Target
Cholecystokinin receptor type A/Gastrin/cholecystokinin type B receptor
Ligand
BDBM50019207
Substrate
Meas. Tech.
ChEMBL_49425 (CHEMBL659628)
IC50
1000±n/a nM
Citation
 Evans, BERittle, KEBock, MGDiPardo, RMFreidinger, RMWhitter, WLLundell, GFVeber, DFAnderson, PSChang, RS Methods for drug discovery: development of potent, selective, orally effective cholecystokinin antagonists. J Med Chem 31:2235-46 (1989)  
Target
Name:
Cholecystokinin receptor type A/Gastrin/cholecystokinin type B receptor
Synonyms:
Cholecystokinin receptor
Type:
Mol. Mass.:
Description:
ASSAY_ID of ChEMBL is 357790
Components:
This complex has 2 components.
Component 1
Name:
Cholecystokinin receptor type A
Synonyms:
CCK-A receptor CCK1-R CCKAR_HUMAN Cholecystokinin receptor Cholecystokinin-1 Receptor
Type:
G Protein-Coupled Receptor (GPCR)
Mol. Mass.:
47859.34
Organism:
Homo sapiens (Human)
Description:
Stable expression of human CCK-1 receptors in HEK 293 cells.
Residue:
428
  
Component 2
Name:
Gastrin/cholecystokinin type B receptor
Synonyms:
CCK-2 receptor CCK-BR CCKRB Cholecystokinin receptor GASR_HUMAN | Gastrin/cholecystokinin type B receptor
Type:
G Protein-Coupled Receptor (GPCR)
Mol. Mass.:
48445.79
Organism:
Homo sapiens (Human)
Description:
Stable expression of human CCK-2 receptors in HEK 293 cells.
Residue:
447
  
Inhibitor
Name:
BDBM50019207
Synonyms:
1-Methyl-1H-indole-2-carboxylic acid [5-(2-fluoro-phenyl)-1-methyl-2-oxo-2,3-dihydro-1H-benzo[e][1,4]diazepin-3-yl]-amide CHEMBL303227
Type:
Small organic molecule
Emp. Form.:
C26H21FN4O2
Mol. Mass.:
440.4689
SMILES:
CN1c2ccccc2C(=NC(NC(=O)c2cc3ccccc3n2C)C1=O)c1ccccc1F
: