Target
Cholecystokinin receptor type A
Ligand
BDBM50019269
Substrate
Meas. Tech.
ChEBML_49558
IC50
730±n/a nM
Citation
 Evans, BERittle, KEBock, MGDiPardo, RMFreidinger, RMWhitter, WLLundell, GFVeber, DFAnderson, PSChang, RS Methods for drug discovery: development of potent, selective, orally effective cholecystokinin antagonists. J Med Chem 31:2235-46 (1989)  
Target
Name:
Cholecystokinin receptor type A
Synonyms:
CCKAR_RAT Cholecystokinin peripheral Cholecystokinin receptor type A
Type:
Enzyme Catalytic Domain
Mol. Mass.:
49676.37
Organism:
RAT
Description:
Cholecystokinin central 0 RAT::P30551
Residue:
444
  
Inhibitor
Name:
BDBM50019269
Synonyms:
4-Cyano-N-(2-oxo-5-phenyl-2,3-dihydro-1H-benzo[e][1,4]diazepin-3-yl)-benzamide CHEMBL72710
Type:
Small organic molecule
Emp. Form.:
C23H16N4O2
Mol. Mass.:
380.3987
SMILES:
O=C(NC1N=C(c2ccccc2)c2ccccc2NC1=O)c1ccc(cc1)C#N
: