Target
Mu-type opioid receptor
Ligand
BDBM50018707
Substrate
Meas. Tech.
ChEBML_148839
Ki
16±n/a nM
Citation
 Gacel, GZajac, JMDelay-Goyet, PDaugé, VRoques, BP Investigation of the structural parameters involved in the mu and delta opioid receptor discrimination of linear enkephalin-related peptides. J Med Chem 31:374-83 (1988)  
Target
Name:
Mu-type opioid receptor
Synonyms:
MOR-1 Mu-type opioid receptor (MOR) OPRM_RAT Opioid receptor B Ror-b
Type:
G Protein-Coupled Receptor (GPCR)
Mol. Mass.:
44503.11
Organism:
Rattus norvegicus (rat)
Description:
Competition binding assays were carried out using membrane preparations from transfected HN9.10 cells that constitutively expressed the mu opioid receptor.
Residue:
398
  
Inhibitor
Name:
BDBM50018707
Synonyms:
2-{2-[2-(2-{2-[2-Amino-3-(4-hydroxy-phenyl)-propionylamino]-3-hydroxy-pentanoylamino}-acetylamino)-3-phenyl-propionylamino]-4-methyl-pentanoylamino}-3-hydroxy-butyric acid | CHEMBL2370601
Type:
Small organic molecule
Emp. Form.:
C35H50N6O10
Mol. Mass.:
714.8057
SMILES:
CC[C@H](O)[C@H](NC(=O)[C@@H](N)Cc1ccc(O)cc1)C(=O)NCC(=O)N[C@@H](Cc1ccccc1)C(=O)N[C@@H](CC(C)C)C(=O)N[C@@H]([C@@H](C)O)C(O)=O
: