Target
Delta-type opioid receptor
Ligand
BDBM50018709
Substrate
Meas. Tech.
ChEBML_146893
Ki
39±n/a nM
Citation
 Gacel, GZajac, JMDelay-Goyet, PDaugé, VRoques, BP Investigation of the structural parameters involved in the mu and delta opioid receptor discrimination of linear enkephalin-related peptides. J Med Chem 31:374-83 (1988)  
Target
Name:
Delta-type opioid receptor
Synonyms:
Cytochrome P450 3A4 Delta opioid receptor Delta-type opioid receptor (DOR) OPRD_RAT Opioid receptor Opioid receptors; mu & delta Ror-a | Voltage-gated potassium channel
Type:
G Protein-Coupled Receptor (GPCR)
Mol. Mass.:
40465.04
Organism:
Rattus norvegicus (rat)
Description:
Competition binding assays were using CHO-K1 cell membranes expressing the opioid receptor.
Residue:
372
  
Inhibitor
Name:
BDBM50018709
Synonyms:
2-Amino-N-(2-tert-butoxy-1-{[(1,3-dimethyl-butylcarbamoyl)-methyl]-carbamoyl}-ethyl)-3-(4-hydroxy-phenyl)-propionamide | CHEMBL2370600
Type:
Small organic molecule
Emp. Form.:
C24H40N4O5
Mol. Mass.:
464.5982
SMILES:
CC(C)CC(C)NC(=O)CNC(=O)[C@@H](COC(C)(C)C)NC(=O)[C@@H](N)Cc1ccc(O)cc1
: