Target
Delta-type opioid receptor
Ligand
BDBM50018722
Substrate
Meas. Tech.
ChEBML_146893
Ki
43.0±n/a nM
Citation
 Gacel, GZajac, JMDelay-Goyet, PDaugé, VRoques, BP Investigation of the structural parameters involved in the mu and delta opioid receptor discrimination of linear enkephalin-related peptides. J Med Chem 31:374-83 (1988)  
Target
Name:
Delta-type opioid receptor
Synonyms:
Cytochrome P450 3A4 Delta opioid receptor Delta-type opioid receptor (DOR) OPRD_RAT Opioid receptor Opioid receptors; mu & delta Ror-a | Voltage-gated potassium channel
Type:
G Protein-Coupled Receptor (GPCR)
Mol. Mass.:
40465.04
Organism:
Rattus norvegicus (rat)
Description:
Competition binding assays were using CHO-K1 cell membranes expressing the opioid receptor.
Residue:
372
  
Inhibitor
Name:
BDBM50018722
Synonyms:
2-Amino-N-(1-{[(1,3-dimethyl-butylcarbamoyl)-methyl]-carbamoyl}-2-hydroxy-ethyl)-3-(4-hydroxy-phenyl)-propionamide | CHEMBL2370599
Type:
Small organic molecule
Emp. Form.:
C20H32N4O5
Mol. Mass.:
408.4919
SMILES:
CC(C)CC(C)NC(=O)CNC(=O)[C@@H](CO)NC(=O)[C@@H](N)Cc1ccc(O)cc1
: