Target
Thymidylate synthase
Ligand
BDBM50023638
Substrate
Meas. Tech.
ChEBML_209978
Ki
93400±n/a nM
Citation
 Chang, GSchwepler, DDecedue, CJBalzarini, JDe Clercq, EMertes, MP Linear free energy relationship studies of enzyme active site binding: thymidylate synthase. J Med Chem 31:1141-7 (1988)  
Target
Name:
Thymidylate synthase
Synonyms:
TS TYSY_MOUSE | Tyms
Type:
PROTEIN
Mol. Mass.:
34957.15
Organism:
Mus musculus
Description:
ChEMBL_1340097
Residue:
307
  
Inhibitor
Name:
BDBM50023638
Synonyms:
CHEMBL3144194 | Phosphoric acid mono-{5-[2,4-dioxo-5-(4-trifluoromethyl-phenyl)-3,4-dihydro-2H-pyrimidin-1-yl]-3-hydroxy-tetrahydro-furan-2-ylmethyl} ester
Type:
Small organic molecule
Emp. Form.:
C16H16F3N2O8P
Mol. Mass.:
452.2758
SMILES:
O[C@H]1C[C@@H](O[C@@H]1COP(O)(O)=O)n1cc(-c2ccc(cc2)C(F)(F)F)c(=O)[nH]c1=O
: