Target
Thymidylate synthase
Ligand
BDBM50023639
Substrate
Meas. Tech.
ChEBML_209777
Ki
66300±n/a nM
Citation
 Chang, GSchwepler, DDecedue, CJBalzarini, JDe Clercq, EMertes, MP Linear free energy relationship studies of enzyme active site binding: thymidylate synthase. J Med Chem 31:1141-7 (1988)  
Target
Name:
Thymidylate synthase
Synonyms:
TS TYMS Thymidylate synthase (TS) | Thymidylate synthase/GAR transformylase/AICAR transformylase
Type:
Enzyme
Mol. Mass.:
35718.07
Organism:
Homo sapiens (Human)
Description:
Residue:
313
  
Inhibitor
Name:
BDBM50023639
Synonyms:
CHEMBL3144192 | Phosphoric acid mono-{5-[5-(4-dimethylamino-phenyl)-2,4-dioxo-3,4-dihydro-2H-pyrimidin-1-yl]-3-hydroxy-tetrahydro-furan-2-ylmethyl} ester
Type:
Small organic molecule
Emp. Form.:
C17H22N3O8P
Mol. Mass.:
427.3456
SMILES:
CN(C)c1ccc(cc1)-c1cn([C@H]2C[C@H](O)[C@@H](COP(O)(O)=O)O2)c(=O)[nH]c1=O
: