Target
Adenosine receptor A1
Ligand
BDBM50407525
Substrate
Meas. Tech.
ChEBML_29311
Ki
16±n/a nM
Citation
 Cristalli, GFranchetti, PGrifantini, MVittori, SKlotz, KNLohse, MJ Adenosine receptor agonists: synthesis and biological evaluation of 1-deaza analogues of adenosine derivatives. J Med Chem 31:1179-83 (1988)  
Target
Name:
Adenosine receptor A1
Synonyms:
AA1R_RAT ADENOSINE A1 high Adenosine A1 receptor (A1) Adenosine receptors A1 | Adora1
Type:
Protein
Mol. Mass.:
36704.13
Organism:
Rattus norvegicus (rat)
Description:
Residue:
326
  
Inhibitor
Name:
BDBM50407525
Synonyms:
CHEMBL2113387
Type:
Small organic molecule
Emp. Form.:
C17H24N4O4
Mol. Mass.:
348.3969
SMILES:
OC[C@H]1O[C@H]([C@H](O)[C@@H]1O)n1cnc2c(NC3CCCCC3)ccnc12
: