Target
Adenosine receptor A1
Ligand
BDBM50118810
Substrate
Meas. Tech.
ChEBML_29311
Ki
1.3±n/a nM
Citation
 Cristalli, GFranchetti, PGrifantini, MVittori, SKlotz, KNLohse, MJ Adenosine receptor agonists: synthesis and biological evaluation of 1-deaza analogues of adenosine derivatives. J Med Chem 31:1179-83 (1988)  
Target
Name:
Adenosine receptor A1
Synonyms:
AA1R_RAT ADENOSINE A1 high Adenosine A1 receptor (A1) Adenosine receptors A1 | Adora1
Type:
Protein
Mol. Mass.:
36704.13
Organism:
Rattus norvegicus (rat)
Description:
Residue:
326
  
Inhibitor
Name:
BDBM50118810
Synonyms:
(2R,3S,4R,5R)-2-(hydroxymethyl)-5-(6-((R)-1-phenylpropan-2-ylamino)-9H-purin-9-yl)-tetrahydrofuran-3,4-diol CHEMBL139000 R-N6-(phenylisopropyl)adenosine
Type:
Small organic molecule
Emp. Form.:
C19H23N5O4
Mol. Mass.:
385.417
SMILES:
C[C@H](Cc1ccccc1)Nc1ncnc2n(cnc12)[C@@H]1O[C@H](CO)[C@@H](O)[C@H]1O
: