Target
Dihydrofolate reductase
Ligand
BDBM50011885
Substrate
Meas. Tech.
ChEBML_54443
IC50
72±n/a nM
Citation
 Rosowsky, ABader, HCucchi, CAMoran, RGKohler, WFreisheim, JH Methotrexate analogues. 33. N delta-acyl-N alpha-(4-amino-4-deoxypteroyl)-L-ornithine derivatives: synthesis and in vitro antitumor activity. J Med Chem 31:1332-7 (1988)  
Target
Name:
Dihydrofolate reductase
Synonyms:
DYR_MOUSE | Dhfr
Type:
Enzyme
Mol. Mass.:
21608.82
Organism:
Mus musculus (Mouse)
Description:
Residue:
187
  
Inhibitor
Name:
BDBM50011885
Synonyms:
5-Amino-2-{4-[(2,4-diamino-pteridin-6-ylmethyl)-amino]-benzoylamino}-pentanoic acid | CHEMBL280864
Type:
Small organic molecule
Emp. Form.:
C19H23N9O3
Mol. Mass.:
425.4444
SMILES:
NCCCC(NC(=O)c1ccc(NCc2cnc3nc(N)nc(N)c3n2)cc1)C(O)=O
: