Target
Muscarinic acetylcholine receptor M2
Ligand
BDBM50405717
Substrate
Meas. Tech.
ChEMBL_140174 (CHEMBL745478)
Ki
37±n/a nM
Citation
 Rzeszotarski, WJMcPherson, DWFerkany, JWKinnier, WJNoronha-Blob, LKirkien-Rzeszotarski, A Affinity and selectivity of the optical isomers of 3-quinuclidinyl benzilate and related muscarinic antagonists. J Med Chem 31:1463-6 (1988)  
Target
Name:
Muscarinic acetylcholine receptor M2
Synonyms:
ACM2_RAT Chrm-2 | Chrm2
Type:
Enzyme Catalytic Domain
Mol. Mass.:
51555.53
Organism:
RAT
Description:
P10980
Residue:
466
  
Inhibitor
Name:
BDBM50405717
Synonyms:
CHEMBL2115341
Type:
Small organic molecule
Emp. Form.:
C16H21NO3
Mol. Mass.:
275.3428
SMILES:
C[C@@](O)(C(=O)O[C@H]1CN2CCC1CC2)c1ccccc1
: