Target
Amine oxidase [flavin-containing] B
Ligand
BDBM50022721
Substrate
Meas. Tech.
ChEBML_122436
Ki
380000±n/a nM
Citation
 Smith, RAWhite, RLKrantz, A Stereoisomers of allenic amines as inactivators of monoamine oxidase type B. Stereochemical probes of the active site. J Med Chem 31:1558-66 (1988)  
Target
Name:
Amine oxidase [flavin-containing] B
Synonyms:
AOFB_BOVIN MAO-B Monoamine Oxidase Type B (MAO-B) Monoamine oxidase B | Monoamine oxidase type B
Type:
PROTEIN
Mol. Mass.:
58428.94
Organism:
Bos taurus
Description:
ChEMBL_1501478
Residue:
520
  
Inhibitor
Name:
BDBM50022721
Synonyms:
(R)-amphetamine CHEMBL19393
Type:
Small organic molecule
Emp. Form.:
C9H13N
Mol. Mass.:
135.2062
SMILES:
C[C@@H](N)Cc1ccccc1
: