Target
Neprilysin
Ligand
BDBM50018218
Substrate
Meas. Tech.
ChEBML_144760
IC50
2.5±n/a nM
Citation
 Hernandez, JFSoleilhac, JMRoques, BPFournié-Zaluski, MC Retro-inverso concept applied to the complete inhibitors of enkephalin-degrading enzymes. J Med Chem 31:1825-31 (1988)  
Target
Name:
Neprilysin
Synonyms:
Atriopeptidase CD_antigen=CD10 MME NEP_RABIT Neutral endopeptidase 24.11
Type:
Enzyme
Mol. Mass.:
85570.75
Organism:
Oryctolagus cuniculus (rabbit)
Description:
NEP was purified to homogeneity from rabbit kidney.
Residue:
750
  
Inhibitor
Name:
BDBM50018218
Synonyms:
(R,S)2-(2-Benzyl-3-hydroxycarbamoyl-propionylamino)-3-phenyl-propionic acid CHEMBL37418
Type:
Small organic molecule
Emp. Form.:
C20H22N2O5
Mol. Mass.:
370.3991
SMILES:
ONC(=O)CC(Cc1ccccc1)C(=O)NC(Cc1ccccc1)C(O)=O
: