Target
Cholecystokinin receptor type A
Ligand
BDBM81962
Substrate
Meas. Tech.
ChEBML_50188
IC50
280±n/a nM
Citation
 Bock, MGDiPardo, RMEvans, BERittle, KEWhitter, WLVeber, DEAnderson, PSFreidinger, RM Benzodiazepine gastrin and brain cholecystokinin receptor ligands: L-365,260. J Med Chem 32:13-6 (1989)  
Target
Name:
Cholecystokinin receptor type A
Synonyms:
CCKAR_RAT Cholecystokinin peripheral Cholecystokinin receptor type A
Type:
Enzyme Catalytic Domain
Mol. Mass.:
49676.37
Organism:
RAT
Description:
Cholecystokinin central 0 RAT::P30551
Residue:
444
  
Inhibitor
Name:
BDBM81962
Synonyms:
S-L-365,260
Type:
Emp. Form.:
C24H22N4O2
Mol. Mass.:
398.4571
SMILES:
CN1c2ccccc2C(=N[C@@H](NC(=O)Nc2cccc(C)c2)C1=O)c1ccccc1
: