Target
Aldo-keto reductase family 1 member B1
Ligand
BDBM16312
Substrate
Meas. Tech.
ChEBML_32099
IC50
180±n/a nM
Citation
 DeRuiter, JBorne, RFMayfield, CA N- and 2-substituted N-(phenylsulfonyl)glycines as inhibitors of rat lens aldose reductase. J Med Chem 32:145-51 (1989)  
Target
Name:
Aldo-keto reductase family 1 member B1
Synonyms:
ALDR_RAT Akr1b4 Aldr1
Type:
PROTEIN
Mol. Mass.:
35797.87
Organism:
Rattus norvegicus
Description:
ChEMBL_1512484
Residue:
316
  
Inhibitor
Name:
BDBM16312
Synonyms:
(4S)-6-fluoro-2,3-dihydrospiro[1-benzopyran-4,4'-imidazolidine]-2',5'-dione Sorbinil
Type:
Small organic molecule
Emp. Form.:
C11H9FN2O3
Mol. Mass.:
236.1992
SMILES:
Fc1ccc2OCC[C@]3(NC(=O)NC3=O)c2c1
: