Target
Platelet-activating factor receptor
Ligand
BDBM50020328
Substrate
Meas. Tech.
ChEBML_164923
IC50
110±n/a nM
Citation
 Takatani, MYoshioka, YTasaka, ATerashita, ZImura, YNishikawa, KTsushima, S Platelet activating factor antagonists: synthesis and structure-activity studies of novel PAF analogues modified in the phosphorylcholine moiety. J Med Chem 32:56-64 (1989)  
Target
Name:
Platelet-activating factor receptor
Synonyms:
PAF-R PTAFR_CAVPO Platelet-activating factor receptor
Type:
Protein
Mol. Mass.:
39005.63
Organism:
Cavia porcellus
Description:
Residue:
342
  
Inhibitor
Name:
BDBM50020328
Synonyms:
2-{[Acetyl-(2-methoxy-3-octadecylcarbamoyloxy-propoxycarbonyl)-amino]-methyl}-1-butyl-pyridinium; chloride | CHEMBL160530
Type:
Small organic molecule
Emp. Form.:
C36H64N3O6
Mol. Mass.:
634.9093
SMILES:
(=O)OCC(COC(=O)N(Cc1cccc[n+]1CCCC)C(C)=O)OC
: