Target
Angiotensin-converting enzyme
Ligand
BDBM50020382
Substrate
Meas. Tech.
ChEBML_34768
IC50
1.7±n/a nM
Citation
 Hayashi, KNunami, KKato, JYoneda, NKubo, MOchiai, TIshida, R Studies on angiotensin converting enzyme inhibitors. 4. Synthesis and angiotensin converting enzyme inhibitory activities of 3-acyl-1-alkyl-2-oxoimidazolidine-4-carboxylic acid derivatives. J Med Chem 32:289-97 (1989)  
Target
Name:
Angiotensin-converting enzyme
Synonyms:
ACE Angiotensin converting enzyme (ACE) Angiotensin-converting enzyme, soluble form CD_antigen=CD143 DCP1 Kininase II
Type:
Enzyme
Mol. Mass.:
149709.01
Organism:
Homo sapiens (Human)
Description:
Residue:
1306
  
Inhibitor
Name:
BDBM50020382
Synonyms:
3-[2-(1-Carboxy-3-phenyl-propylamino)-propionyl]-1-methyl-2-oxo-imidazolidine-4-carboxylic acid Imidaprilat
Type:
Small organic molecule
Emp. Form.:
C18H23N3O6
Mol. Mass.:
377.3917
SMILES:
C[C@H](N[C@@H](CCc1ccccc1)C(O)=O)C(=O)N1[C@@H](CN(C)C1=O)C(O)=O
: