Target
Phenylethanolamine N-methyltransferase
Ligand
BDBM50020500
Substrate
Meas. Tech.
ChEBML_152563
Ki
>2000000±n/a nM
Citation
 Ye, QHGrunewald, GL Conformationally restricted and conformationally defined tyramine analogues as inhibitors of phenylethanolamine N-methyltransferase. J Med Chem 32:478-86 (1989)  
Target
Name:
Phenylethanolamine N-methyltransferase
Synonyms:
Noradrenaline N-methyltransferase PNMT_BOVIN | PNMTase
Type:
Enzyme
Mol. Mass.:
30916.97
Organism:
Bos taurus (bovine)
Description:
Residue:
283
  
Inhibitor
Name:
BDBM50020500
Synonyms:
5-Methoxy-1,2,3,4-tetrahydro-1,4-methano-naphthalen-2-ylamine | CHEMBL434450
Type:
Small organic molecule
Emp. Form.:
C12H15NO
Mol. Mass.:
189.2536
SMILES:
COc1cccc2C3CC(CC3N)c12
: