Target
Acetylcholinesterase
Ligand
BDBM50011780
Substrate
Meas. Tech.
ChEBML_27812
IC50
346000±n/a nM
Citation
 Bedford, CDHarris, RNHowd, RAGoff, DAKoolpe, GAPetesch, MMiller, ANolen, HWMusallam, HAPick, RO Quaternary salts of 2-[(hydroxyimino)methyl]imidazole. 2. Preparation and in vitro and in vivo evaluation of 1-(alkoxymethyl)-2-[(hydroxyimino)methyl]-3-methylimida zolium halides for reactivation of organophosphorus-inhibited acetylcholinesterases. J Med Chem 32:493-503 (1989)  
Target
Name:
Acetylcholinesterase
Synonyms:
ACES_BOVIN Acetylcholinesterase (AChE) | Acetylcholinesterase precursor
Type:
Enzyme
Mol. Mass.:
67659.62
Organism:
Bos taurus (bovine)
Description:
Residue:
613
  
Inhibitor
Name:
BDBM50011780
Synonyms:
2-[(E)-(hydroxyimino)methyl]-1-methylpyridinium chloride PRALIDOXIME Pralidoxine chloride
Type:
Small organic molecule
Emp. Form.:
C7H9N2O
Mol. Mass.:
137.1586
SMILES:
C[n+]1ccccc1CN=O
: