Target
Adenosine receptor A1
Ligand
BDBM50367863
Substrate
Meas. Tech.
ChEBML_28977
Ki
0.469000±n/a nM
Citation
 Jacobson, KABarone, SKammula, UStiles, GL Electrophilic derivatives of purines as irreversible inhibitors of A1 adenosine receptors. J Med Chem 32:1043-51 (1989)  
Target
Name:
Adenosine receptor A1
Synonyms:
AA1R_RAT ADENOSINE A1 high Adenosine A1 receptor (A1) Adenosine receptors A1 | Adora1
Type:
Protein
Mol. Mass.:
36704.13
Organism:
Rattus norvegicus (rat)
Description:
Residue:
326
  
Inhibitor
Name:
BDBM50367863
Synonyms:
CHEMBL604356
Type:
Small organic molecule
Emp. Form.:
C36H36N10O6S2
Mol. Mass.:
768.864
SMILES:
OC[C@H]1OC([C@H](O)[C@@H]1O)n1cnc2c(Nc3ccc(CC(=O)Nc4ccc(CC(=O)NCCNC(=S)Nc5ccc(cc5)N=C=S)cc4)cc3)ncnc12
: