Target
Aminopeptidase B
Ligand
BDBM50017479
Substrate
Meas. Tech.
ChEMBL_35355 (CHEMBL647937)
Ki
8800±n/a nM
Citation
 Harbeson, SLRich, DH Inhibition of aminopeptidases by peptides containing ketomethylene and hydroxyethylene amide bond replacements. J Med Chem 32:1378-92 (1989)  
Target
Name:
Aminopeptidase B
Synonyms:
AMPB_RAT Arginine aminopeptidase Cytosol aminopeptidase IV | Rnpep
Type:
PROTEIN
Mol. Mass.:
72609.93
Organism:
Rattus norvegicus
Description:
ChEMBL_1344423
Residue:
650
  
Inhibitor
Name:
BDBM50017479
Synonyms:
2-(5,9-Diamino-2-methyl-4-oxo-nonanoylamino)-3-phenyl-propionic acid | CHEMBL28708
Type:
Small organic molecule
Emp. Form.:
C19H29N3O4
Mol. Mass.:
363.4513
SMILES:
CC(CC(=O)[C@@H](N)CCCCN)C(=O)NC(Cc1ccccc1)C(O)=O
: