Target
Aminopeptidase B
Ligand
BDBM50017476
Substrate
Meas. Tech.
ChEBML_35354
Ki
4±n/a nM
Citation
 Harbeson, SLRich, DH Inhibition of aminopeptidases by peptides containing ketomethylene and hydroxyethylene amide bond replacements. J Med Chem 32:1378-92 (1989)  
Target
Name:
Aminopeptidase B
Synonyms:
AMPB_RAT Arginine aminopeptidase Cytosol aminopeptidase IV | Rnpep
Type:
PROTEIN
Mol. Mass.:
72609.93
Organism:
Rattus norvegicus
Description:
ChEMBL_1344423
Residue:
650
  
Inhibitor
Name:
BDBM50017476
Synonyms:
5,9-Diamino-2-benzyl-4-oxo-nonanoic acid | CHEMBL28623
Type:
Small organic molecule
Emp. Form.:
C16H24N2O3
Mol. Mass.:
292.3734
SMILES:
NCCCC[C@H](N)C(=O)CC(Cc1ccccc1)C(O)=O
: