Target
Aminopeptidase B
Ligand
BDBM50017477
Substrate
Meas. Tech.
ChEMBL_35341 (CHEMBL646059)
IC50
>400000±n/a nM
Citation
 Harbeson, SLRich, DH Inhibition of aminopeptidases by peptides containing ketomethylene and hydroxyethylene amide bond replacements. J Med Chem 32:1378-92 (1989)  
Target
Name:
Aminopeptidase B
Synonyms:
AMPB_RAT Arginine aminopeptidase Cytosol aminopeptidase IV | Rnpep
Type:
PROTEIN
Mol. Mass.:
72609.93
Organism:
Rattus norvegicus
Description:
ChEMBL_1344423
Residue:
650
  
Inhibitor
Name:
BDBM50017477
Synonyms:
5-Amino-2,7-dimethyl-4-oxo-octanoic acid [2-methyl-1-(3-methyl-butylcarbamoyl)-propyl]-amide | CHEMBL27803
Type:
Small organic molecule
Emp. Form.:
C20H39N3O3
Mol. Mass.:
369.542
SMILES:
CC(C)CCNC(=O)[C@@H](NC(=O)[C@H](C)CC(=O)[C@@H](N)CC(C)C)C(C)C
: