Target
Muscarinic receptor M1
Ligand
BDBM50403547
Substrate
Meas. Tech.
ChEBML_138126
Ki
2.4±n/a nM
Citation
 Leader, HSmejkal, RMPayne, CSPadilla, FNDoctor, BPGordon, RKChiang, PK Binary antidotes for organophosphate poisoning: aprophen analogues that are both antimuscarinics and carbamates. J Med Chem 32:1522-8 (1989)  
Target
Name:
Muscarinic receptor M1
Synonyms:
Muscarinic acetylcholine receptor M1
Type:
PROTEIN
Mol. Mass.:
15022.43
Organism:
Bos taurus
Description:
ChEMBL_140161
Residue:
139
  
Inhibitor
Name:
BDBM50403547
Synonyms:
ATROPEN | ATROPINE
Type:
Small organic molecule
Emp. Form.:
C17H23NO3
Mol. Mass.:
289.3694
SMILES:
CN1[C@H]2CC[C@@H]1C[C@@H](C2)OC(=O)C(CO)c1ccccc1
: