Target
Adenosine receptor A1
Ligand
BDBM50018432
Substrate
Meas. Tech.
ChEBML_29628
Ki
18±n/a nM
Citation
 Jacobson, KAKiriasis, LBarone, SBradbury, BJKammula, UCampagne, JMSecunda, SDaly, JWNeumeyer, JLPfleiderer, W Sulfur-containing 1,3-dialkylxanthine derivatives as selective antagonists at A1-adenosine receptors. J Med Chem 32:1873-9 (1989)  
Target
Name:
Adenosine receptor A1
Synonyms:
AA1R_RAT ADENOSINE A1 high Adenosine A1 receptor (A1) Adenosine receptors A1 | Adora1
Type:
Protein
Mol. Mass.:
36704.13
Organism:
Rattus norvegicus (rat)
Description:
Residue:
326
  
Inhibitor
Name:
BDBM50018432
Synonyms:
CHEMBL56399 | N-(2-{2-[4-(2,6-Dioxo-1,3-dipropyl-2,3,6,7-tetrahydro-1H-purin-8-yl)-phenoxy]-acetylamino}-ethyl)-2-thiophen-2-yl-acetamide
Type:
Small organic molecule
Emp. Form.:
C27H32N6O5S
Mol. Mass.:
552.645
SMILES:
CCCn1c2nc([nH]c2c(=O)n(CCC)c1=O)-c1ccc(OCC(=O)NCCNC(=O)Cc2cccs2)cc1
: