Target
Alpha-mannosidase 2C1
Ligand
BDBM50016704
Substrate
Meas. Tech.
ChEBML_105324
IC50
>1000000±n/a nM
Citation
 Winkler, DAHolan, G Design of potential anti-HIV agents. 1. Mannosidase inhibitors. J Med Chem 32:2084-9 (1989)  
Target
Name:
Alpha-mannosidase 2C1
Synonyms:
MA2C1_RAT | Man2c1
Type:
PROTEIN
Mol. Mass.:
115965.84
Organism:
Rattus norvegicus
Description:
ChEMBL_32499
Residue:
1040
  
Inhibitor
Name:
BDBM50016704
Synonyms:
6-Epi-Castanospermine Octahydro-indolizine-1,6,7,8-tetraol
Type:
Small organic molecule
Emp. Form.:
C8H15NO4
Mol. Mass.:
189.209
SMILES:
[H][C@]12[C@@H](O)CCN1C[C@@H](O)[C@@H](O)[C@@H]2O
: