Target
Amine oxidase [flavin-containing] B
Ligand
BDBM50014651
Substrate
Meas. Tech.
ChEBML_123766
Ki
1000±n/a nM
Citation
 Bembenek, MEAbell, CWChrisey, LARozwadowska, MDGessner, WBrossi, A Inhibition of monoamine oxidases A and B by simple isoquinoline alkaloids: racemic and optically active 1,2,3,4-tetrahydro-, 3,4-dihydro-, and fully aromatic isoquinolines. J Med Chem 33:147-52 (1990)  
Target
Name:
Amine oxidase [flavin-containing] B
Synonyms:
AOFB_HUMAN MAOB Monoamine oxidase type B (MAO B) Monoamine oxidase type B (MAOB)
Type:
Protein
Mol. Mass.:
58768.76
Organism:
Homo sapiens (Human)
Description:
P27338
Residue:
520
  
Inhibitor
Name:
BDBM50014651
Synonyms:
2-Methyl-1,2,3,4-tetrahydro-isoquinoline CHEMBL22053 | CHEMBL545413
Type:
Small organic molecule
Emp. Form.:
C10H13N
Mol. Mass.:
147.2169
SMILES:
CN1CCc2ccccc2C1
: