Target
Aromatase
Ligand
BDBM50014759
Substrate
Meas. Tech.
ChEBML_51212
EC50
17±n/a nM
Citation
 Jones, CDWinter, MAHirsch, KSStamm, NTaylor, HMHolden, HEDavenport, JDKrumkalns, EVSuhr, RG Estrogen synthetase inhibitors. 2. Comparison of the in vitro aromatase inhibitory activity for a variety of nitrogen heterocycles substituted with diarylmethane or diarylmethanol groups. J Med Chem 33:416-29 (1990)  
Target
Name:
Aromatase
Synonyms:
Arom CP19A_RAT Cyp19 Cytochrome P450 19A1 P-450AROM
Type:
PROTEIN
Mol. Mass.:
58418.09
Organism:
Rattus norvegicus
Description:
ChEMBL_51211
Residue:
508
  
Inhibitor
Name:
BDBM50014759
Synonyms:
5-[Bis-(4-chloro-phenyl)-imidazol-1-yl-methyl]-thiazole | CHEMBL133262
Type:
Small organic molecule
Emp. Form.:
C19H13Cl2N3S
Mol. Mass.:
386.298
SMILES:
Clc1ccc(cc1)C(c1cncs1)(c1ccc(Cl)cc1)n1ccnc1
: