Target
Aromatase
Ligand
BDBM50014764
Substrate
Meas. Tech.
ChEBML_51212
EC50
11±n/a nM
Citation
 Jones, CDWinter, MAHirsch, KSStamm, NTaylor, HMHolden, HEDavenport, JDKrumkalns, EVSuhr, RG Estrogen synthetase inhibitors. 2. Comparison of the in vitro aromatase inhibitory activity for a variety of nitrogen heterocycles substituted with diarylmethane or diarylmethanol groups. J Med Chem 33:416-29 (1990)  
Target
Name:
Aromatase
Synonyms:
Arom CP19A_RAT Cyp19 Cytochrome P450 19A1 P-450AROM
Type:
PROTEIN
Mol. Mass.:
58418.09
Organism:
Rattus norvegicus
Description:
ChEMBL_51211
Residue:
508
  
Inhibitor
Name:
BDBM50014764
Synonyms:
5-[Bis-(4-chloro-phenyl)-imidazol-1-yl-methyl]-1H-[1,2,4]triazole | CHEMBL135172
Type:
Small organic molecule
Emp. Form.:
C18H13Cl2N5
Mol. Mass.:
370.235
SMILES:
Clc1ccc(cc1)C(c1nnc[nH]1)(c1ccc(Cl)cc1)n1ccnc1
: