Target
Pepsin A
Ligand
BDBM912
Substrate
Meas. Tech.
ChEBML_153990
IC50
18±n/a nM
Citation
 Iizuka, KKamijo, THarada, HAkahane, KKubota, TUmeyama, HIshida, TKiso, Y Orally potent human renin inhibitors derived from angiotensinogen transition state: design, synthesis, and mode of interaction. J Med Chem 33:2707-14 (1990)  
Target
Name:
Pepsin A
Synonyms:
PEPA_PIG Pepsin | Pepsin A precursor
Type:
Enzyme
Mol. Mass.:
41232.87
Organism:
Porcine
Description:
Residue:
385
  
Inhibitor
Name:
BDBM912
Synonyms:
(3S,4S)-3-hydroxy-4-[(2S)-2-[(3S,4S)-3-hydroxy-6-methyl-4-[(2S)-3-methyl-2-[(2S)-3-methyl-2-(3-methylbutanamido)butanamido]butanamido]heptanamido]propanamido]-6-methylheptanoic acid Iva-Val-Val-Sta-Ala-Sta-OH PEPSTATIN US9115083, Pepstatin
Type:
Small organic molecule
Emp. Form.:
C34H63N5O9
Mol. Mass.:
685.8921
SMILES:
CC(C)C[C@H](NC(=O)[C@H](C)NC(=O)C[C@H](O)[C@H](CC(C)C)NC(=O)[C@@H](NC(=O)[C@@H](NC(=O)CC(C)C)C(C)C)C(C)C)[C@@H](O)CC(O)=O
: