Target
5-hydroxytryptamine receptor 3A
Ligand
BDBM50014156
Substrate
Meas. Tech.
ChEBML_3465
Ki
0.420000±n/a nM
Citation
 Rosen, TNagel, AARizzi, JPIves, JLDaffeh, JBGanong, AHGuarino, KHeym, JMcLean, SNowakowski, JT Thiazole as a carbonyl bioisostere. A novel class of highly potent and selective 5-HT3 receptor antagonists. J Med Chem 33:2715-20 (1990)  
Target
Name:
5-hydroxytryptamine receptor 3A
Synonyms:
5-HT-3 5-HT3A 5-hydroxytryptamine receptor 3 (5-HT3) 5-hydroxytryptamine receptor 3A (5HT3A) 5HT3R HTR3A Serotonin 3 receptor (5HT3) Serotonin-gated ion channel receptor | Serotonin-gated ion channel receptor 3
Type:
Protein
Mol. Mass.:
55283.27
Organism:
Homo sapiens (Human)
Description:
P46098
Residue:
478
  
Inhibitor
Name:
BDBM50014156
Synonyms:
4-(2-Methoxy-phenyl)-2-(5-methyl-1H-imidazol-4-ylmethyl)-thiazole | CHEMBL93919
Type:
Small organic molecule
Emp. Form.:
C15H15N3OS
Mol. Mass.:
285.364
SMILES:
COc1ccccc1-c1csc(Cc2[nH]cnc2C)n1
: