Target
Beta-1 adrenergic receptor
Ligand
BDBM50010838
Substrate
Meas. Tech.
ChEBML_56503
IC50
33100±n/a nM
Citation
 Lis, RMorgan, TKMarisca, AJGomez, RPLind, JMDavey, DDPhillips, GBSullivan, ME Synthesis of novel (aryloxy)propanolamines and related compounds possessing both class II and class III antiarrhythmic activity. J Med Chem 33:2883-91 (1990)  
Target
Name:
Beta-1 adrenergic receptor
Synonyms:
ADRB1 ADRB1_HUMAN Beta-1 adrenoceptor | adrenergic Beta1
Type:
G Protein-Coupled Receptor (GPCR)
Mol. Mass.:
51338.40
Organism:
Homo sapiens (Human)
Description:
P08588
Residue:
477
  
Inhibitor
Name:
BDBM50010838
Synonyms:
CHEMBL100624 | N-{4-[2-Hydroxy-3-(4-imidazol-1-yl-benzylamino)-propoxy]-phenyl}-methanesulfonamide
Type:
Small organic molecule
Emp. Form.:
C20H24N4O4S
Mol. Mass.:
416.494
SMILES:
CS(=O)(=O)Nc1ccc(OCC(O)CNCc2ccc(cc2)-n2ccnc2)cc1
: