Target
Beta-1 adrenergic receptor
Ligand
BDBM50010844
Substrate
Meas. Tech.
ChEMBL_56503 (CHEMBL667338)
IC50
5100±n/a nM
Citation
 Lis, RMorgan, TKMarisca, AJGomez, RPLind, JMDavey, DDPhillips, GBSullivan, ME Synthesis of novel (aryloxy)propanolamines and related compounds possessing both class II and class III antiarrhythmic activity. J Med Chem 33:2883-91 (1990)  
Target
Name:
Beta-1 adrenergic receptor
Synonyms:
ADRB1 ADRB1_HUMAN Beta-1 adrenoceptor | adrenergic Beta1
Type:
G Protein-Coupled Receptor (GPCR)
Mol. Mass.:
51338.40
Organism:
Homo sapiens (Human)
Description:
P08588
Residue:
477
  
Inhibitor
Name:
BDBM50010844
Synonyms:
CHEMBL316868 | N-[4-(1-Hydroxy-2-{2-[4-(3H-imidazol-1-yl)-phenoxy]-ethylamino}-ethyl)-phenyl]-methanesulfonamide
Type:
Small organic molecule
Emp. Form.:
C20H24N4O4S
Mol. Mass.:
416.494
SMILES:
CS(=O)(=O)Nc1ccc(cc1)C(O)CNCCOc1ccc(cc1)-n1ccnc1
: