Target
Transporter
Ligand
BDBM50010881
Substrate
Meas. Tech.
ChEBML_177401
IC50
10400±n/a nM
Citation
 Yardley, JPHusbands, GEStack, GButch, JBicksler, JMoyer, JAMuth, EAAndree, TFletcher, HJames, MN 2-Phenyl-2-(1-hydroxycycloalkyl)ethylamine derivatives: synthesis and antidepressant activity. J Med Chem 33:2899-905 (1990)  
Target
Name:
Transporter
Synonyms:
Monoamine transporters; Norepininephrine & dopamine | Norepinephrine Monoamine transporters
Type:
PROTEIN
Mol. Mass.:
66787.87
Organism:
Rattus norvegicus
Description:
ChEMBL_1463061
Residue:
597
  
Inhibitor
Name:
BDBM50010881
Synonyms:
1-[2-Dimethylamino-1-(4-trifluoromethyl-phenyl)-ethyl]-cyclopentanol (HCl) | CHEMBL100773
Type:
Small organic molecule
Emp. Form.:
C16H22F3NO
Mol. Mass.:
301.3472
SMILES:
CN(C)CC(c1ccc(cc1)C(F)(F)F)C1(O)CCCC1
: