Target
D(1A) dopamine receptor
Ligand
BDBM50007129
Substrate
Meas. Tech.
ChEMBL_58648 (CHEMBL666362)
Ki
1.6±n/a nM
Citation
 DeNinno, MPSchoenleber, RAsin, KEMacKenzie, RKebabian, JW (1R,3S)-1-(aminomethyl)-3,4-dihydro-5,6-dihydroxy-3-phenyl-1H-2-benzopyran: a potent and selective D1 agonist. J Med Chem 33:2948-50 (1990)  
Target
Name:
D(1A) dopamine receptor
Synonyms:
DOPAMINE D1 Dopamine D1 high Dopamine receptor Dopamine1-like Drd1a
Type:
Enzyme Catalytic Domain
Mol. Mass.:
49429.75
Organism:
RAT
Description:
P18901
Residue:
446
  
Inhibitor
Name:
BDBM50007129
Synonyms:
(1R,3S)-1-Aminomethyl-3-phenyl-isochroman-5,6-diol A-70108 | CHEMBL86931
Type:
Small organic molecule
Emp. Form.:
C16H17NO3
Mol. Mass.:
271.3111
SMILES:
NC[C@@H]1O[C@@H](Cc2c(O)c(O)ccc12)c1ccccc1
: