Target
Gastrin/cholecystokinin type B receptor
Ligand
BDBM50007916
Substrate
Meas. Tech.
ChEBML_47834
IC50
1900±n/a nM
Citation
 Shiosaki, KLin, CWKopecka, HCraig, RWagenaar, FLBianchi, BMiller, TWitte, DNadzan, AM Development of CCK-tetrapeptide analogues as potent and selective CCK-A receptor agonists. J Med Chem 33:2950-2 (1990)  
Target
Name:
Gastrin/cholecystokinin type B receptor
Synonyms:
CCK-2 receptor CCK-BR CCKRB Cholecystokinin receptor GASR_HUMAN | Gastrin/cholecystokinin type B receptor
Type:
G Protein-Coupled Receptor (GPCR)
Mol. Mass.:
48445.79
Organism:
Homo sapiens (Human)
Description:
Stable expression of human CCK-2 receptors in HEK 293 cells.
Residue:
447
  
Inhibitor
Name:
BDBM50007916
Synonyms:
3-{1-[1-aminobutyl oxycarbonylamino-2-(1H-3-indolyl)ethylcarboxamido]-5-formamido-ortho-chloro phenylaminopentylcarboxamido}-3-(1-carbamoyl-2-phenylethylcarbamoyl)propanoic acid | CHEMBL319340
Type:
Small organic molecule
Emp. Form.:
C42H51ClN8O9
Mol. Mass.:
847.356
SMILES:
CC(C)(C)OC(=O)N[C@@H](Cc1c[nH]c2ccccc12)C(=O)N[C@@H](CCCCNC(=O)Nc1ccccc1Cl)C(=O)N[C@@H](CC(O)=O)C(=O)N[C@@H](Cc1ccccc1)C(N)=O
: