Target
Adenosine receptor A2a/A2b
Ligand
BDBM50228562
Substrate
Meas. Tech.
ChEMBL_30720 (CHEMBL646486)
Ki
4.7±n/a nM
Citation
 Peet, NPLentz, NLMeng, ECDudley, MWOgden, AMDemeter, DAWeintraub, HJBey, P A novel synthesis of xanthines: support for a new binding mode for xanthines with respect to adenosine at adenosine receptors. J Med Chem 33:3127-30 (1991)  
Target
Name:
Adenosine receptor A2a/A2b
Synonyms:
Adenosine A2 receptor
Type:
Mol. Mass.:
Description:
ASSAY_ID of ChEMBL is 30560
Components:
This complex has 2 components.
Component 1
Name:
Adenosine receptor A2b
Synonyms:
AA2BR_RAT Adora2b
Type:
PROTEIN
Mol. Mass.:
36378.84
Organism:
Rattus norvegicus
Description:
ChEMBL_32934
Residue:
332
  
Component 2
Name:
Adenosine receptor A2a
Synonyms:
AA2AR_RAT Adenosine A2 receptor Adenosine Receptors A2a (A2a) Adenosine receptors A2a Rat striatal adenosine A2a receptor
Type:
G Protein-Coupled Receptor (GPCR)
Mol. Mass.:
45015.65
Organism:
Rattus norvegicus (rat)
Description:
Rat A2A receptors expressed in CHO cells.
Residue:
410
  
Inhibitor
Name:
BDBM50228562
Synonyms:
CHEMBL321505
Type:
Small organic molecule
Emp. Form.:
C13H18N4O2
Mol. Mass.:
262.3076
SMILES:
Cn1c2[nH]c(nc2c(=O)n(C)c1=O)C1CCCCC1
: