Target
5-hydroxytryptamine receptor 2C
Ligand
BDBM50000483
Substrate
Meas. Tech.
ChEMBL_1866 (CHEMBL872910)
Ki
>1000±n/a nM
Citation
 Robertson, DWBloomquist, WCohen, MLReid, LRSchenck, KWong, DT Synthesis and biochemical evaluation of tritium-labeled 1-methyl-N-(8-methyl-8-azabicyclo[3.2.1]oct-3-yl)-1H-indazole-3-carboxa mide, a useful radioligand for 5HT3 receptors. J Med Chem 33:3176-81 (1991)  
Target
Name:
5-hydroxytryptamine receptor 2C
Synonyms:
5-HT2C 5-hydroxytryptamine receptor 2C (5HT2c) 5ht1c Htr2c Serotonin receptor 2a and 2c (5HT2A and 5HT2C)
Type:
Enzyme
Mol. Mass.:
51935.10
Organism:
Rattus norvegicus (Rat)
Description:
P08909
Residue:
460
  
Inhibitor
Name:
BDBM50000483
Synonyms:
(BRL 43694)1-Methyl-1H-indazole-3-carboxylic acid (9-methyl-9-aza-bicyclo[3.3.1]non-3-yl)-amide 1-Methyl-1H-indazole-3-carboxylic acid (8-methyl-8-aza-bicyclo[3.2.1]oct-3-yl)-amide 1-Methyl-1H-indazole-3-carboxylic acid (9-methyl-9-aza-bicyclo[3.3.1]non-3-yl)-amide(BRL 43694) 1-methyl-N-((1S,5R)-9-methyl-9-aza-bicyclo[3.3.1]nonan-3-yl)-1H-indazole-3-carboxamide BRL 43694 CHEMBL519643 LY-278584
Type:
Small organic molecule
Emp. Form.:
C18H24N4O
Mol. Mass.:
312.4094
SMILES:
CN1C2CCCC1CC(C2)NC(=O)c1nn(C)c2ccccc12
: