Target
Cholecystokinin receptor type A
Ligand
BDBM50008170
Substrate
Meas. Tech.
ChEBML_50184
IC50
18±n/a nM
Citation
 Freidinger, RMWhitter, WLGould, NPHolloway, MKChang, RSLotti, VJ Novel glutamic acid derived cholecystokinin receptor ligands. J Med Chem 33:591-5 (1990)  
Target
Name:
Cholecystokinin receptor type A
Synonyms:
CCKAR_RAT Cholecystokinin peripheral Cholecystokinin receptor type A
Type:
Enzyme Catalytic Domain
Mol. Mass.:
49676.37
Organism:
RAT
Description:
Cholecystokinin central 0 RAT::P30551
Residue:
444
  
Inhibitor
Name:
BDBM50008170
Synonyms:
4-(3,4-Dichloro-benzoylamino)-4-dipentylcarbamoyl-butyric acid Lorglumide
Type:
Small organic molecule
Emp. Form.:
C22H32Cl2N2O4
Mol. Mass.:
459.406
SMILES:
CCCCCN(CCCCC)C(=O)C(CCC(O)=O)NC(=O)c1ccc(Cl)c(Cl)c1
: