Target
Ribonucleoside-diphosphate reductase large subunit
Ligand
BDBM50013350
Substrate
Meas. Tech.
ChEBML_195110
IC50
55000±n/a nM
Citation
 Gaudreau, PParadis, HLangelier, YBrazeau, P Synthesis and inhibitory potency of peptides corresponding to the subunit 2 C-terminal region of herpes virus ribonucleotide reductases. J Med Chem 33:723-30 (1990)  
Target
Name:
Ribonucleoside-diphosphate reductase large subunit
Synonyms:
ICP6 RIR1 Ribonucleoside-diphosphate reductase large chain Ribonucleotide reductase 136 kDa subunit | Ribonucleotide reductase large subunit
Type:
PROTEIN
Mol. Mass.:
124049.68
Organism:
Human herpesvirus 1 (strain 17) (HHV-1) (Human herpes simplex virus1)
Description:
ChEMBL_195109
Residue:
1137
  
Inhibitor
Name:
BDBM50013350
Synonyms:
CHEMBL349664 | Leu-Ala-Gly-Ala-Val-Val-Asn-Asp-Leu
Type:
Small organic molecule
Emp. Form.:
C38H66N10O13
Mol. Mass.:
870.9898
SMILES:
CC(C)C[C@H](N)C(=O)N[C@@H](C)C(=O)NCC(=O)N[C@@H](C)C(=O)N[C@@H](C(C)C)C(=O)N[C@@H](C(C)C)C(=O)N[C@@H](CC(N)=O)C(=O)N[C@@H](CC(O)=O)C(=O)N[C@@H](CC(C)C)C(O)=O
: