Target
Ribonucleoside-diphosphate reductase large subunit
Ligand
BDBM50013366
Substrate
Meas. Tech.
ChEBML_195110
IC50
36000±n/a nM
Citation
 Gaudreau, PParadis, HLangelier, YBrazeau, P Synthesis and inhibitory potency of peptides corresponding to the subunit 2 C-terminal region of herpes virus ribonucleotide reductases. J Med Chem 33:723-30 (1990)  
Target
Name:
Ribonucleoside-diphosphate reductase large subunit
Synonyms:
ICP6 RIR1 Ribonucleoside-diphosphate reductase large chain Ribonucleotide reductase 136 kDa subunit | Ribonucleotide reductase large subunit
Type:
PROTEIN
Mol. Mass.:
124049.68
Organism:
Human herpesvirus 1 (strain 17) (HHV-1) (Human herpes simplex virus1)
Description:
ChEMBL_195109
Residue:
1137
  
Inhibitor
Name:
BDBM50013366
Synonyms:
(S)-2-[(S)-2-((S)-2-{(S)-2-[(S)-2-((S)-2-Amino-propionylamino)-3-methyl-butyrylamino]-3-methyl-butyrylamino}-3-carbamoyl-propionylamino)-3-carboxy-propionylamino]-4-methyl-pentanoic acid CHEMBL318787 | H-Ala-Val-Val-Asn-Asp-Leu-OH
Type:
Small organic molecule
Emp. Form.:
C27H47N7O10
Mol. Mass.:
629.703
SMILES:
CC(C)C[C@H](NC(=O)[C@H](CC(O)=O)NC(=O)[C@H](CC(N)=O)NC(=O)[C@@H](NC(=O)[C@@H](NC(=O)[C@H](C)N)C(C)C)C(C)C)C(O)=O
: