Target
D(2) dopamine receptor
Ligand
BDBM21398
Substrate
Meas. Tech.
ChEMBL_62709 (CHEMBL675802)
Ki
0.330000±n/a nM
Citation
 Högberg, TBengtsson, Sde Paulis, TJohansson, LStröm, PHall, HOgren, SO Potential antipsychotic agents 5. Synthesis and antidopaminergic properties of substituted 5,6-dimethoxysalicylamides and related compounds. J Med Chem 33:1155-63 (1990)  
Target
Name:
D(2) dopamine receptor
Synonyms:
DOPAMINE D2 DOPAMINE D2 Short Dopamine D2 receptor Drd2
Type:
G Protein-Coupled Receptor (GPCR)
Mol. Mass.:
50931.60
Organism:
Rattus norvegicus (rat)
Description:
P61169
Residue:
444
  
Inhibitor
Name:
BDBM21398
Synonyms:
4-[4-(4-Chloro-phenyl)-4-hydroxy-piperidin-1-yl]-1-(4-fluoro-phenyl)-butan-1-one;propionate(HCl) CHEMBL54 Haloperidol | Haloperidol, 1
Type:
Small organic molecule
Emp. Form.:
C21H23ClFNO2
Mol. Mass.:
375.864
SMILES:
OC1(CCN(CCCC(=O)c2ccc(F)cc2)CC1)c1ccc(Cl)cc1
: