Target
Angiotensin-converting enzyme
Ligand
BDBM50013615
Substrate
Meas. Tech.
ChEMBL_35061 (CHEMBL648935)
IC50
26±n/a nM
Citation
 Mencel, JJRegan, JRBarton, JMenard, PRBruno, JGCalvo, RRKornberg, BESchwab, ANeiss, ESSuh, JT Angiotensin converting enzyme inhibitors. 10. Aryl sulfonamide substituted N-[1-carboxy-3-phenylpropyl]-L-alanyl-L-proline derivatives as novel antihypertensives. J Med Chem 33:1606-15 (1990)  
Target
Name:
Angiotensin-converting enzyme
Synonyms:
3.2.1.- ACE Angiotensin-converting enzyme, soluble form DCP1 Kininase II
Type:
Mol. Mass.:
150405.15
Organism:
Oryctolagus cuniculus
Description:
Residue:
1310
  
Inhibitor
Name:
BDBM50013615
Synonyms:
1-[2-(1-Carboxy-3-phenyl-propylamino)-propionyl]-4-[N'-(4-chloro-3-sulfamoyl-benzoyl)-hydrazino]-pyrrolidine-2-carboxylic acid : (Hydrochloride) | CHEMBL43859
Type:
Small organic molecule
Emp. Form.:
C25H30ClN5O8S
Mol. Mass.:
596.052
SMILES:
C[C@H](N[C@@H](CCc1ccccc1)C(O)=O)C(=O)N1CC(C[C@H]1C(O)=O)NNC(=O)c1ccc(Cl)c(c1)S(N)(=O)=O
: