Target
5-hydroxytryptamine receptor 3A/3B
Ligand
BDBM50007885
Substrate
Meas. Tech.
ChEMBL_3409 (CHEMBL620723)
Ki
34±n/a nM
Citation
 Turconi, MNicola, MQuintero, MGMaiocchi, LMicheletti, RGiraldo, EDonetti, A Synthesis of a new class of 2,3-dihydro-2-oxo-1H-benzimidazole-1-carboxylic acid derivatives as highly potent 5-HT3 receptor antagonists. J Med Chem 33:2101-8 (1990)  
Target
Name:
5-hydroxytryptamine receptor 3A/3B
Synonyms:
Serotonin 3 (5-HT3) receptor | Serotonin 3a (5-HT3a)/3b (5-HT3b) receptor
Type:
Mol. Mass.:
Description:
ASSAY_ID of EBI is 2974
Components:
This complex has 2 components.
Component 1
Name:
5-hydroxytryptamine receptor 3B
Synonyms:
5HT3B_RAT Serotonin (5-HT) receptor
Type:
PROTEIN
Mol. Mass.:
50328.78
Organism:
Rattus norvegicus
Description:
EBI_11885
Residue:
437
  
Component 2
Name:
5-hydroxytryptamine receptor 3A
Synonyms:
5-HT3 5HT3A_RAT Htr3 Serotonin (5-HT) receptor | Zacopride site-R
Type:
Enzyme Catalytic Domain
Mol. Mass.:
55428.70
Organism:
RAT
Description:
5-HT3 HTR3A RAT::P35563
Residue:
483
  
Inhibitor
Name:
BDBM50007885
Synonyms:
6-Fluoro-2-oxo-2,3-dihydro-benzoimidazole-1-carboxylic acid 8-methyl-8-aza-bicyclo[3.2.1]oct-3-yl ester; hydrochloride | CHEMBL539003
Type:
Small organic molecule
Emp. Form.:
C16H18FN3O3
Mol. Mass.:
319.3308
SMILES:
CN1C2CCC1CC(C2)OC(=O)n1c2cc(F)ccc2[nH]c1=O
: