Target
D(1A) dopamine receptor
Ligand
BDBM50010709
Substrate
Meas. Tech.
ChEMBL_58970 (CHEMBL668636)
Ki
6±n/a nM
Citation
 Pettersson, ILiljefors, TBøgesø, K Conformational analysis and structure-activity relationships of selective dopamine D-1 receptor agonists and antagonists of the benzazepine series. J Med Chem 33:2197-204 (1990)  
Target
Name:
D(1A) dopamine receptor
Synonyms:
DA D1 receptor DRD1 Dopamine D1 receptor Dopamine D1A
Type:
Enzyme
Mol. Mass.:
49303.43
Organism:
Homo sapiens (Human)
Description:
P21728
Residue:
446
  
Inhibitor
Name:
BDBM50010709
Synonyms:
5-Benzofuran-7-yl-8-chloro-3-methyl-2,3,4,5-tetrahydro-1H-benzo[d]azepin-7-ol NNC-112 | NNC-112,(-)
Type:
Small organic molecule
Emp. Form.:
C19H18ClNO2
Mol. Mass.:
327.805
SMILES:
CN1CCc2cc(Cl)c(O)cc2[C@H](C1)c1cccc2ccoc12
: