Target
Adenylate cyclase type 5
Ligand
BDBM50010714
Substrate
Meas. Tech.
ChEBML_31727
EC50
210±n/a nM
Citation
 Pettersson, ILiljefors, TBøgesø, K Conformational analysis and structure-activity relationships of selective dopamine D-1 receptor agonists and antagonists of the benzazepine series. J Med Chem 33:2197-204 (1990)  
Target
Name:
Adenylate cyclase type 5
Synonyms:
ADCY5 Adenylate cyclase | Adenylate cyclase type V
Type:
PROTEIN
Mol. Mass.:
138919.21
Organism:
Homo sapiens (Human)
Description:
ChEMBL_31732
Residue:
1261
  
Inhibitor
Name:
BDBM50010714
Synonyms:
1-p-Tolyl-2,3,4,5-tetrahydro-1H-benzo[d]azepine-7,8-diol | CHEMBL68922
Type:
Small organic molecule
Emp. Form.:
C17H19NO2
Mol. Mass.:
269.3383
SMILES:
Cc1ccc(cc1)[C@H]1CNCCc2cc(O)c(O)cc12
: