Target
Adenosine receptor A1
Ligand
BDBM50009552
Substrate
Meas. Tech.
ChEMBL_29333 (CHEMBL643147)
Ki
1.3±n/a nM
Citation
 Sarges, RHoward, HRBrowne, RGLebel, LASeymour, PAKoe, BK 4-Amino[1,2,4]triazolo[4,3-a]quinoxalines. A novel class of potent adenosine receptor antagonists and potential rapid-onset antidepressants. J Med Chem 33:2240-54 (1990)  
Target
Name:
Adenosine receptor A1
Synonyms:
AA1R_RAT ADENOSINE A1 high Adenosine A1 receptor (A1) Adenosine receptors A1 | Adora1
Type:
Protein
Mol. Mass.:
36704.13
Organism:
Rattus norvegicus (rat)
Description:
Residue:
326
  
Inhibitor
Name:
BDBM50009552
Synonyms:
2-[6-Amino-2-(2-morpholin-4-yl-ethylamino)-purin-9-yl]-5-hydroxymethyl-tetrahydro-furan-3,4-diol CHEMBL45891 | N6-Cyclohexylado (CHA)
Type:
Small organic molecule
Emp. Form.:
C16H23N5O4
Mol. Mass.:
349.3849
SMILES:
OC[C@H]1O[C@H]([C@H](O)[C@@H]1O)n1cnc2c(NC3CCCCC3)ncnc12
: