Target
Mu-type opioid receptor
Ligand
BDBM50013388
Substrate
Meas. Tech.
ChEBML_146692
IC50
0.500000±n/a nM
Citation
 Klein, PNelson, WLYao, YHSimon, EJ Electrophilic alpha-methylene-gamma-lactone and isothiocyanate opioid ligands related to etorphine. J Med Chem 33:2286-96 (1990)  
Target
Name:
Mu-type opioid receptor
Synonyms:
MOR-1 OPIATE Mu OPRM_BOVIN
Type:
Enzyme Catalytic Domain
Mol. Mass.:
45038.37
Organism:
CALF
Description:
OPIATE Mu 2 0 CALF::P79350
Residue:
401
  
Inhibitor
Name:
BDBM50013388
Synonyms:
6-Ethyl-3-(1-hydroxy-cyclopropylmethyl)-11,11-dimethyl-1,2,3,4,5,6-hexahydro-2,6-methano-benzo[d]azocin-8-ol Bremazocine | CHEMBL350384
Type:
Small organic molecule
Emp. Form.:
C20H29NO2
Mol. Mass.:
315.4498
SMILES:
CCC12CCN(CC3(O)CC3)C(Cc3ccc(O)cc13)C2(C)C
: