Target
Sigma non-opioid intracellular receptor 1
Ligand
BDBM50010800
Substrate
Meas. Tech.
ChEMBL_201266 (CHEMBL804883)
IC50
37±n/a nM
Citation
 Scherz, MWFialeix, MFischer, JBReddy, NLServer, ACSonders, MSTester, BCWeber, EWong, STKeana, JF Synthesis and structure-activity relationships of N,N'-di-o-tolylguanidine analogues, high-affinity ligands for the haloperidol-sensitive sigma receptor. J Med Chem 33:2421-9 (1990)  
Target
Name:
Sigma non-opioid intracellular receptor 1
Synonyms:
Aging-associated gene 8 protein SGMR1_HUMAN SIGMAR1 SR31747-binding protein Sigma 1-type opioid receptor Sigma1R | hSigmaR1
Type:
Enzyme Catalytic Domain
Mol. Mass.:
25124.85
Organism:
Homo sapiens (Human)
Description:
Q99720
Residue:
223
  
Inhibitor
Name:
BDBM50010800
Synonyms:
CHEMBL79436 | N,N'-Bis-(4-bromo-2-methyl-phenyl)-guanidine
Type:
Small organic molecule
Emp. Form.:
C15H15Br2N3
Mol. Mass.:
397.108
SMILES:
Cc1cc(Br)ccc1NC(N)=Nc1ccc(Br)cc1C
: