Target
Sigma non-opioid intracellular receptor 1
Ligand
BDBM50010778
Substrate
Meas. Tech.
ChEMBL_201720 (CHEMBL803918)
IC50
513±n/a nM
Citation
 Scherz, MWFialeix, MFischer, JBReddy, NLServer, ACSonders, MSTester, BCWeber, EWong, STKeana, JF Synthesis and structure-activity relationships of N,N'-di-o-tolylguanidine analogues, high-affinity ligands for the haloperidol-sensitive sigma receptor. J Med Chem 33:2421-9 (1990)  
Target
Name:
Sigma non-opioid intracellular receptor 1
Synonyms:
Aging-associated gene 8 protein SGMR1_HUMAN SIGMAR1 SR31747-binding protein Sigma 1-type opioid receptor Sigma1R | hSigmaR1
Type:
Enzyme Catalytic Domain
Mol. Mass.:
25124.85
Organism:
Homo sapiens (Human)
Description:
Q99720
Residue:
223
  
Inhibitor
Name:
BDBM50010778
Synonyms:
CHEMBL312806 | N,N'-Dicyclohexyl-N''-cyclopropyl-guanidine
Type:
Small organic molecule
Emp. Form.:
C16H29N3
Mol. Mass.:
263.4216
SMILES:
[#6]-1-[#6]-[#6]-1\[#7]=[#6](/[#7]-[#6]-1-[#6]-[#6]-[#6]-[#6]-[#6]-1)-[#7]-[#6]-1-[#6]-[#6]-[#6]-[#6]-[#6]-1
: